Changes between Initial Version and Version 1 of Ticket #13484


Ignore:
Timestamp:
Sep 23, 2018, 12:44:54 PM (4 years ago)
Author:
Ryan J Ollos
Comment:

Legend:

Unmodified
Added
Removed
Modified
  • Ticket #13484

    • Property Summary changed from Release 1.2.3 brekas advanced ticket workflow plugin to Test failures with release 1.2.3
  • Ticket #13484 – Description

    initial v1  
    1 This plugin is broken with release 1.2.3.
     1{{{
     2$ python setup.py test
     3running test
     4running egg_info
     5writing requirements to TracAdvancedTicketWorkflow.egg-info/requires.txt
     6writing TracAdvancedTicketWorkflow.egg-info/PKG-INFO
     7writing top-level names to TracAdvancedTicketWorkflow.egg-info/top_level.txt
     8writing dependency_links to TracAdvancedTicketWorkflow.egg-info/dependency_links.txt
     9writing entry points to TracAdvancedTicketWorkflow.egg-info/entry_points.txt
     10writing manifest file 'TracAdvancedTicketWorkflow.egg-info/SOURCES.txt'
     11running build_ext
     12test_reset_milestone (advancedworkflow.tests.controller.AdvancedTicketWorkflowTestCase) ... ok
     13test_set_owner_to_component_owner (advancedworkflow.tests.controller.AdvancedTicketWorkflowTestCase) ... FAIL
     14test_set_owner_to_component_owner_with_missing_component (advancedworkflow.tests.controller.AdvancedTicketWorkflowTestCase) ... FAIL
     15test_set_owner_to_field (advancedworkflow.tests.controller.AdvancedTicketWorkflowTestCase) ... FAIL
     16test_set_owner_to_previous (advancedworkflow.tests.controller.AdvancedTicketWorkflowTestCase) ... FAIL
     17test_set_owner_to_reporter (advancedworkflow.tests.controller.AdvancedTicketWorkflowTestCase) ... FAIL
     18test_set_status_to_previous (advancedworkflow.tests.controller.AdvancedTicketWorkflowTestCase) ... ok
    219
    3 Simply run the build. The tests will fail.
     20======================================================================
     21FAIL: test_set_owner_to_component_owner (advancedworkflow.tests.controller.AdvancedTicketWorkflowTestCase)
     22----------------------------------------------------------------------
     23Traceback (most recent call last):
     24  File "/Users/rjollos/Documents/Workspace/trac-dev/trac-hacks/advancedticketworkflowplugin/1.2/advancedworkflow/tests/controller.py", line 88, in test_set_owner_to_component_owner
     25    self.assertEqual('assigned', ticket['status'])
     26AssertionError: 'assigned' != u'new'
     27
     28======================================================================
     29FAIL: test_set_owner_to_component_owner_with_missing_component (advancedworkflow.tests.controller.AdvancedTicketWorkflowTestCase)
     30----------------------------------------------------------------------
     31Traceback (most recent call last):
     32  File "/Users/rjollos/Documents/Workspace/trac-dev/trac-hacks/advancedticketworkflowplugin/1.2/advancedworkflow/tests/controller.py", line 106, in test_set_owner_to_component_owner_with_missing_component
     33    self.assertEqual('assigned', ticket['status'])
     34AssertionError: 'assigned' != u'new'
     35
     36======================================================================
     37FAIL: test_set_owner_to_field (advancedworkflow.tests.controller.AdvancedTicketWorkflowTestCase)
     38----------------------------------------------------------------------
     39Traceback (most recent call last):
     40  File "/Users/rjollos/Documents/Workspace/trac-dev/trac-hacks/advancedticketworkflowplugin/1.2/advancedworkflow/tests/controller.py", line 125, in test_set_owner_to_field
     41    self.assertEqual('assigned', ticket['status'])
     42AssertionError: 'assigned' != u'new'
     43
     44======================================================================
     45FAIL: test_set_owner_to_previous (advancedworkflow.tests.controller.AdvancedTicketWorkflowTestCase)
     46----------------------------------------------------------------------
     47Traceback (most recent call last):
     48  File "/Users/rjollos/Documents/Workspace/trac-dev/trac-hacks/advancedticketworkflowplugin/1.2/advancedworkflow/tests/controller.py", line 144, in test_set_owner_to_previous
     49    self.assertEqual('assigned', ticket['status'])
     50AssertionError: 'assigned' != u'new'
     51
     52======================================================================
     53FAIL: test_set_owner_to_reporter (advancedworkflow.tests.controller.AdvancedTicketWorkflowTestCase)
     54----------------------------------------------------------------------
     55Traceback (most recent call last):
     56  File "/Users/rjollos/Documents/Workspace/trac-dev/trac-hacks/advancedticketworkflowplugin/1.2/advancedworkflow/tests/controller.py", line 69, in test_set_owner_to_reporter
     57    self.assertEqual('needinfo', ticket['status'])
     58AssertionError: 'needinfo' != u'new'
     59
     60----------------------------------------------------------------------
     61Ran 7 tests in 0.272s
     62
     63FAILED (failures=5)
     64Test failed: <unittest.runner.TextTestResult run=7 errors=0 failures=5>
     65error: Test failed: <unittest.runner.TextTestResult run=7 errors=0 failures=5>
     66}}}